{"text_format":"1","workbook":"xlsx","n_sheets":21,"sheets":["0. Capa","1. P0","2. Fator X","3. Mercado","4. WACC","5. Outras Receitas","6. Perdas de Água","7. Opex - Parcela B","8. Opex - Parcela A","8.1 Opex A Energia Elétrica","9. CAPEX","10. BRRt","11. Anuidade Regulatória","12. Capital de Giro","13. Receitas Irrecuperáveis","14. Ajuste Ordinário","15. Ajustes Extraordinários","15.1 Ajustes Extra. Cont. Graf.","16. Receita Verificada","Aux. - IPCA","Aux. - OPEX Realizado - Resumo"],"not_rendered":{"charts":0,"images":4,"macros":1,"external_links":0,"defined_names":985,"comments":10,"pivot_tables":0},"unopened":[],"bounds":{"document_bytes":16777216,"sheet_cells":100000,"rows_first":2000,"rows_last":500,"rows_between":2000,"halvings":0,"cell_chars":16384,"cell_head_chars":4096},"cells_cut":0,"cells_raw":0,"read":"whole","date_system":"1900"}

{"sheet":"0. Capa","index":0,"n_rows":37,"n_cols":6,"rows_kept":37,"cut":false,"hidden":false,"merged":[[7,2,12,4]]}
[]
[]
[]
[null,null,"Modelo Econômico-Financeiro - 3a RTP Sanepar"]
[]
[]
[]
[null,null,"Esta planilha foi desenvolvida como parte integrante da Nota Técnica 003/2025-Agepar-DRE/CSB que apresenta os resultados preliminares (Pré Audiência Pública) da 3ª Revisão Tarifária Periódica dos serviços de saneamento básico do Estado do Paraná para o cálculo da tarifa média econômica (P0) do terceiro ciclo tarifário da Sanepar, envolvendo os anos base de 2025 a 2028. A metodologia adotada é a descrita na Nota Técnica 007/2024-Agepar-DRE/CSB, disponível no site da Agepar.\n\nVersão da planilha: Pré Audiência Pública"]
{"$rows_left_out":30}
{"sheet":"1. P0","index":1,"n_rows":44,"n_cols":12,"rows_kept":44,"cut":false,"hidden":false,"merged":[[6,2,7,2],[6,3,7,3],[6,4,7,4],[28,9,31,11],[6,5,7,5],[6,6,7,6]]}
[]
[]
[]
[]
[null,null,"Cálculo do P0 - Fluxo de Caixa Descontado"]
[]
[null,null,"ID","Descrição","Componentes Fórmula","Composição do P0","Composição do P0 \n(com Fator X)","Valor Presente","Ciclo Tarifário - R$ (Dez/24) x 1000"]
[null,null,null,null,null,null,null,2024,2025,{"$f":"I8+1","v":2026},2027,2028]
{"$rows_left_out":37}
{"sheet":"2. Fator X","index":2,"n_rows":33,"n_cols":10,"rows_kept":33,"cut":false,"hidden":false,"merged":[[6,2,7,2],[6,3,7,3],[6,4,7,4],[29,7,31,9]]}
[]
[]
[null,null,"Fator X"]
[]
[null,null,null,"Redução do Opex",0]
[]
[null,null,"ID","Descrição","Componentes Fórmula","Valor Presente","Ciclo Tarifário - R$ (Dez/24) x 1000"]
[null,null,null,null,null,2024,2025,2026,2027,2028]
{"$rows_left_out":26}
{"sheet":"3. Mercado","index":3,"n_rows":41,"n_cols":12,"rows_kept":41,"cut":false,"hidden":false,"merged":[[0,0,0,8],[17,0,17,2],[2,0,8,0],[10,0,16,0]]}
["Histórico e Projeções de Mercado"]
[null,"Medida",2024,2025,2026,2027,2028,null,"Fonte:",null,"Incluindo perdas"]
["Água","Volume Residencial Medido",474936046,478470373,484097301,490493783,497324560,null,"Agepar"]
[null,"Volume Não Residencial Medido",83911796,90990708,97259214,103528989,109798776,null,"Agepar",null,"Não alterado"]
[null,"Volume Produzido",857357536,857899299.97618175,871730155.89612722,886317205.54355848,901324085.86319995,null,"Agepar"]
[null,"Volume Faturado",580157387,585756301,596381271,607147031,617912847,null,"Agepar"]
[null,"Ligações",3481918,3516142,3550653,3585164,3619676,null,"Agepar"]
[null,"Economias Residenciais",3913067,3944116,3974940,4005765,4036590,null,"Agepar"]
{"$rows_left_out":34}
{"sheet":"4. WACC","index":4,"n_rows":23,"n_cols":9,"rows_kept":23,"cut":false,"hidden":false,"merged":[[1,2,2,2]]}
["Tabela - Resultado Cálculo WACC Regulatório"]
["Variáveis de entrada e WACC final","Valor","Descrição"]
["Custo de Capital Próprio Nominal (%) (Ke)",{"$f":"B4","v":0.15349707190877993}]
["Custo de Capital Próprio Nominal (%) (Ke)",{"$f":"B5+B7*(B8)+B9","v":0.15349707190877993},"Rf + β(Rm - Rf) + Rp",null,null,null,null,"Mediana Risco País",3.0700000000000002E-2]
["Taxa Livre de Risco (Rf)",{"$f":"I10","v":3.7400000000000003E-2},"Média 1995-2024 TBOND10"]
["Retorno de Mercado (Rm)",{"$f":"I12","v":0.1255},"média dos retornos do S&P 500 de 1995 até 2024",null,null,null,null,"média IGUUC509 (Bloomberg) AAA(bra)",5.7500000000000002E-2]
["Beta Alavancado ",{"$f":"I21","v":0.96931977194982899},"Média 2020-2024 Betas Damodaran, realavancados para a estrutura de capital da Sanepar"]
["Prêmio de Risco Mercado (%) (Rm - Rf)",{"$f":"B6-B5","v":8.8099999999999998E-2},"Diferença entre a média dos retornos do S&P 500 e o USTBill 10 anos de 1995 até 2024",null,null,null,null,"média Infação",2.53E-2]
{"$rows_left_out":16}
{"sheet":"5. Outras Receitas","index":5,"n_rows":43,"n_cols":9,"rows_kept":43,"cut":false,"hidden":false,"merged":[[1,0,1,8],[8,0,8,8],[14,0,14,8],[26,0,26,8]]}
["Conta Contábil","Conta","% Reversão para Modicidade",2021,2022,2023,2024,"Média","Montante para Reversão"]
["Serviços de água"]
["31-122","Acréscimo por Impontualidade",1,31205272.988901217,31011920.792122904,33608945.2052406,41340360.899999999,{"$f":"AVERAGE(D3:G3)","v":34291624.971566178},{"$f":"H3*C3","v":34291624.971566178}]
["31-123","Religações",0.75,189406.93157315967,506688.31032546656,1457585.7699619238,2567210.04,{"$f":"AVERAGE(D4:G4)","v":1180222.7629651376},885167.0722238532]
["31-126","Sanções",1,4475071.3992939591,3631260.2704395521,4623804.7326062592,8855381.1400000006,5396379.385584943,5396379.385584943]
["31-128","Outros",0.75,15817776.983907785,14881123.651105406,14388074.604229566,15780096.24,15216767.869810691,11412575.902358018]
["31-129","Devolução de valores (DV)",1,-351846.11996571918,-287454.69025608234,-279113.38631931104,-352877.58,-317822.94413527817,-317822.94413527817]
["31-000","Água Industrial (fornecimento)",0.5,2093654.0746098065,4595765.0286078807,-7863933.3266007397,1752485.3,{"$f":"AVERAGE(D8:G8)","v":144492.76915423694},{"$f":"IF(H8<0,0,H8*C8)","v":72246.384577118471}]
{"$rows_left_out":36}
{"sheet":"6. Perdas de Água","index":6,"n_rows":17,"n_cols":3,"rows_kept":17,"cut":false,"hidden":false,"merged":[]}
[" Sigla do Prestador "," Ano de Referência "," IN051 - Índice de perdas por ligação "]
["SANEPAR",2022,222.68]
["SANEPAR",2021,222.94]
["SANEPAR",2020,226.34]
["SANEPAR",2019,229.8]
[]
["Itens de cálculo","Valor"]
["Média 19 - 22",{"$f":"AVERAGE(C2:C5)","v":225.44}]
{"$rows_left_out":10}
{"sheet":"7. Opex - Parcela B","index":7,"n_rows":59,"n_cols":18,"rows_kept":59,"cut":false,"hidden":false,"merged":[[0,5,0,8],[2,14,2,17]]}
[null,null,null,null,null,"IPCA até dez/2024"]
[null,null,null,null,null,2021,2022,2023,2024]
[null,null,null,null,null,1.1602048352625147,1.0967564553473925,1.0483119674839478,1,null,null,null,null,null,"Projeção"]
["Pessoal",2021,2022,2023,2024,"2021 atualiz. IPCA","2022 atualiz. IPCA","2023 atualiz. IPCA","2024 atualiz. IPCA","Ano mais recente","Media","Mediana","Valor referência","Driver",2025,2026,2027,2028]
["Produção",0.19276864007007796,0.23345188241874945,0.23785600252713898,0.56652072663793795,{"$f":"B5*F$3","v":0.22365110829628379},{"$f":"C5*G$3","v":0.25603985905576393},0.24934729398709193,0.56652072663793795,0.24934729398709193,{"$f":"AVERAGE(F5:I5)","v":0.32388974699426942},{"$f":"MEDIAN(F5:I5)","v":0.25269357652142793},{"$f":"SMALL(J5:L5,1)","v":0.24934729398709193},"Volume Produzido de Água",{"$f":"VLOOKUP('7. Opex - Parcela B'!$N5,'3. Mercado'!$B$24:$L$29,8+O$4-$O$4,FALSE)*$M5","v":213914868.96248135},{"$f":"VLOOKUP('7. Opex - Parcela B'!$N5,'3. Mercado'!$B$24:$L$29,8+P$4-$O$4,FALSE)*$M5","v":217363555.45964512},{"$f":"VLOOKUP('7. Opex - Parcela B'!$N5,'3. Mercado'!$B$24:$L$29,8+Q$4-$O$4,FALSE)*$M5","v":221000796.81648746},{"$f":"VLOOKUP('7. Opex - Parcela B'!$N5,'3. Mercado'!$B$24:$L$29,8+R$4-$O$4,FALSE)*$M5","v":224742721.81537822}]
["Distribuição",37.564545356535007,43.529778507641574,43.049561787435231,52.198140509908903,{"$f":"B6*F$3","v":43.582567157089962},47.741565578098083,45.129370816708004,52.198140509908903,45.129370816708004,{"$f":"AVERAGE(F6:I6)","v":47.162911015451243},46.43546819740304,{"$f":"SMALL(J6:L6,1)","v":45.129370816708004},"Ligações de Água",{"$f":"VLOOKUP('7. Opex - Parcela B'!$N6,'3. Mercado'!$B$24:$L$29,8+O$4-$O$4,FALSE)*$M6","v":158681276.16220132},{"$f":"VLOOKUP('7. Opex - Parcela B'!$N6,'3. Mercado'!$B$24:$L$29,8+P$4-$O$4,FALSE)*$M6","v":160238735.87845671},{"$f":"VLOOKUP('7. Opex - Parcela B'!$N6,'3. Mercado'!$B$24:$L$29,8+Q$4-$O$4,FALSE)*$M6","v":161796195.59471214},{"$f":"VLOOKUP('7. Opex - Parcela B'!$N6,'3. Mercado'!$B$24:$L$29,8+R$4-$O$4,FALSE)*$M6","v":163353700.44033837}]
["Coleta",22.262315014186687,25.591432980534744,26.742429447730931,30.24153980658744,25.828845523596673,28.067569322991641,28.034408829651476,30.24153980658744,28.034408829651476,28.043090870706806,{"$f":"MEDIAN(F7:I7)","v":28.050989076321557},{"$f":"SMALL(J7:L7,1)","v":28.034408829651476},"Ligações de Esgoto",{"$f":"VLOOKUP('7. Opex - Parcela B'!$N7,'3. Mercado'!$B$24:$L$29,8+O$4-$O$4,FALSE)*$M7","v":75002164.040905207},{"$f":"VLOOKUP('7. Opex - Parcela B'!$N7,'3. Mercado'!$B$24:$L$29,8+P$4-$O$4,FALSE)*$M7","v":78420679.853592902},{"$f":"VLOOKUP('7. Opex - Parcela B'!$N7,'3. Mercado'!$B$24:$L$29,8+Q$4-$O$4,FALSE)*$M7","v":80808482.59124963},{"$f":"VLOOKUP('7. Opex - Parcela B'!$N7,'3. Mercado'!$B$24:$L$29,8+R$4-$O$4,FALSE)*$M7","v":83148346.489807665}]
["Tratamento",0.20921887593996782,0.23558525152134069,0.23320308024833278,0.5588922293145322,0.24273675149373888,0.25837964539066954,0.2444695798784467,0.5588922293145322,0.2444695798784467,0.32611955151934685,0.25142461263455812,0.2444695798784467,"Volume Tratado de Esgoto",{"$f":"VLOOKUP('7. Opex - Parcela B'!$N8,'3. Mercado'!$B$24:$L$29,8+O$4-$O$4,FALSE)*$M8","v":111415266.67802082},{"$f":"VLOOKUP('7. Opex - Parcela B'!$N8,'3. Mercado'!$B$24:$L$29,8+P$4-$O$4,FALSE)*$M8","v":114650562.30298172},{"$f":"VLOOKUP('7. Opex - Parcela B'!$N8,'3. Mercado'!$B$24:$L$29,8+Q$4-$O$4,FALSE)*$M8","v":118019109.31142455},{"$f":"VLOOKUP('7. Opex - Parcela B'!$N8,'3. Mercado'!$B$24:$L$29,8+R$4-$O$4,FALSE)*$M8","v":121450475.65323585}]
{"$rows_left_out":52}
{"sheet":"8. Opex - Parcela A","index":8,"n_rows":15,"n_cols":7,"rows_kept":15,"cut":false,"hidden":false,"merged":[[0,3,0,6],[0,0,1,0],[0,1,1,1],[0,2,1,2]]}
["Itens OPEX Parcela A","Valor referencial (nominal - set.2024)","Referência","Projeção (R$ dez/2024)"]
[null,null,null,2025,2026,2027,2028]
["Energia Elétrica","-","Metodologia específica. Dados reais até set/2024",{"$f":"'8.1 Opex A Energia Elétrica'!B65","v":545389520.19918442},{"$f":"'8.1 Opex A Energia Elétrica'!C65","v":555857317.46029234},{"$f":"'8.1 Opex A Energia Elétrica'!D65","v":566905254.32910037},{"$f":"'8.1 Opex A Energia Elétrica'!E65","v":578270319.88561893}]
["Locação de ativos - CPC06","-","Anexo 23, 23.013.629-7",87393149.169622451,88540118.013902068,90220759.436815858,96961193.880751729]
["PPP","-","Anexo 28, 23.013.629-7",128527987,174021792,353371589,371027827]
["Leasing litoral","-","Anexo 24, 23.013.629-7",47752009.230000004,47752009.180000007,47752009.18,47752009.25]
["Encargos, impostos e taxas:","-","-",{"$f":"SUM(D8:D14)","v":212643793.66666669},{"$f":"SUM(E8:E14)","v":212643793.66666669},212643793.66666669,212643793.66666669]
["421 – REPASSE PELA UTILIZ MANANCIAL",3917191.17,"Dados reais até set/2024, extrapolado para dez/2024",{"$f":"B8/9*12","v":5222921.5599999996},{"$f":"$D8","v":5222921.5599999996},{"$f":"$D8","v":5222921.5599999996},5222921.5599999996]
{"$rows_left_out":8}
{"sheet":"8.1 Opex A Energia Elétrica","index":9,"n_rows":65,"n_cols":6,"rows_kept":65,"cut":false,"hidden":false,"merged":[[37,0,37,5],[47,0,47,4],[55,0,55,4],[29,1,29,4],[1,1,1,5],[14,1,14,5]]}
["Energia Elétrica"]
["Quantidade de energia (GWH)","Realizado"]
["ETAPA",2020,2021,2022,2023,"2024*"]
["Produção de Água",402.34,413.16,421.28,436.67,473.15]
["Distribuição de Água",223.01,223.32,235.49,241.67,254.16]
["Coleta de Esgoto",37.229999999999997,40.72,44.33,50.11,51.83]
["Tratamento de Esgoto",37.229999999999997,40.72,44.33,50.11,51.83]
["Comerciais",3.42,3.48,3.21,3.12,3.39]
{"$rows_left_out":58}
{"sheet":"9. CAPEX","index":10,"n_rows":40,"n_cols":6,"rows_kept":40,"cut":false,"hidden":false,"merged":[[0,22,0,25],[0,1,1,1],[0,2,1,2],[0,3,1,3],[0,4,1,4],[0,5,1,5]]}
["Tipo de serviço",2025,2026,2027,2028,"Total (R$ milhões)"]
["  Tipologia de investimento"]
["Água",735.81460419378243,716.17638469400572,703.24825909385811,835.92436858313874,2991.1636165647851]
["Administrativo",0,0,0,0,0]
["Adutora",21.962367244983742,11.796575637435973,77.897529178778981,56.960925322590796,168.61739738378949]
["Captação",146.35334184767865,7.1369616202450219,34.898554198813535,55.310379010062128,243.69923667679933]
["Captação (poço)",13.401421906806489,1.8176477515781602,0.3029520545901383,1.3980719232616663,16.920093636236455]
["Elevação de água tratada",0.19076021908047705,36.368981153663853,29.417116569318036,25.984278973457776,91.961136915520143]
{"$rows_left_out":33}
{"sheet":"10. BRRt","index":11,"n_rows":12,"n_cols":7,"rows_kept":12,"cut":false,"hidden":false,"merged":[]}
[]
[]
[null,null,"Movimentação da Base de Ativos"]
[]
[null,null,"Descrição",2025,2026,2027,2028]
[null,null,"BRRL (t-1)",{"$f":"21598749993.52","v":21598749993.52},{"$f":"D12","v":22220551290.220398},{"$f":"E12","v":23629130949.694275},24511511435.866745]
[null,null,"% Depreciação estimada",{"$f":"798505354.78/(21598749993.52+1827673331.12)","v":3.4085670856128049E-2},{"$f":"D7","v":3.4085670856128049E-2},{"$f":"E7","v":3.4085670856128049E-2},3.4085670856128049E-2]
[null,null,"Depreciação BRRL Inicial",{"$f":"D6*D7","v":736207883.18292058},{"$f":"D8","v":736207883.18292058},{"$f":"E8","v":736207883.18292058},736207883.18292058]
{"$rows_left_out":5}
{"sheet":"11. Anuidade Regulatória","index":12,"n_rows":15,"n_cols":4,"rows_kept":15,"cut":false,"hidden":false,"merged":[]}
[]
[]
[null,null,"Custos com ativos não operacionais "]
[]
[null,null,"Ativos imobilizados (por ano)","Valor Líquido (dez/24)"]
[null,null,2021,12842526.046708055]
[null,null,2022,15698450.11853477]
[null,null,2023,17878446.35194584]
{"$rows_left_out":8}
{"sheet":"12. Capital de Giro","index":13,"n_rows":70,"n_cols":18,"rows_kept":70,"cut":false,"hidden":false,"merged":[[50,14,50,17],[27,14,27,17],[39,14,39,17],[44,14,44,17],[56,3,56,7],[56,8,56,12]]}
[]
[null,null,"Capital Giro"]
[]
[null,null,null,"Real Contábil","Real Contábil","Real Contábil","Real Contábil","Real Contábil","Real Contábil","Real Contábil","Real Contábil","Real Contábil","Real Contábil","Estimado","Projetado","Projetado","Projetado","Projetado"]
[null,null,"Descrição",2016,{"$f":"D5+1","v":2017},{"$f":"E5+1","v":2018},2019,2020,"inicial 2021",{"$f":"H5+1","v":2021},{"$f":"J5+1","v":2022},2023,"2024-09-01","inicial 2025",2025,{"$f":"O5+1","v":2026},2027,2028]
[]
[null,null,"I - Ativo Circulante Operacional s/ disponibilidades",{"$f":"SUM(D10:D14)","v":668910000},{"$f":"SUM(E10:E14)","v":705326000},737900000,896600000,872478000,0,1075804000,1245844000,1428736000,{"$f":"SUM(M10:M14)","v":1463131986.4100001},0,{"$f":"SUM(O10:O14)","v":1498390494.4117856},1532514018.7081027,1567615326.5727229,1603106489.8645234]
[null,null,"Disponível","não considerado","não considerado","não considerado","não considerado","não considerado",0,"não considerado","não considerado","não considerado","não considerado",0,"não projetado","não projetado","não projetado","não projetado"]
{"$rows_left_out":63}
{"sheet":"13. Receitas Irrecuperáveis","index":14,"n_rows":62,"n_cols":7,"rows_kept":62,"cut":false,"hidden":false,"merged":[]}
["Prazo","Mês de Referência","Valor Pendente, posição em 31/08/2024","Faturamento total (A+E+S) por mês","Aging \n(Pendência Total / Faturamento Total)",null,"Média %Aging mês 49-60"]
["Prazo","Data","Pendência Total","Faturamento Total","% Aging Total",null,{"$f":"AVERAGE(E51:E62)","v":6.5740900624107852E-3}]
[1,45505,245388606.03999999,667598872.63,0.36756893413149982]
[2,45474,77686457.969999999,663362091.75,0.11711018602986066]
[3,45444,42207025.060000002,675161725.83000004,6.2513948059057148E-2]
[4,45413,30399338.800000001,673116986.36000001,4.5162043769523395E-2]
[5,45383,25936352.810000002,655355652.92999995,3.9575996169472764E-2]
[6,45352,24590892.949999999,677975884.24000001,3.6271043737147068E-2]
{"$rows_left_out":55}
{"sheet":"14. Ajuste Ordinário","index":15,"n_rows":58,"n_cols":11,"rows_kept":58,"cut":false,"hidden":false,"merged":[[6,2,7,2],[6,3,7,3],[6,4,7,4],[6,5,7,5],[35,8,37,10]]}
[]
[]
[]
[]
[null,null,"Cálculo do P0 - Fluxo de Caixa Descontado"]
[]
[null,null,"ID","Descrição","Fonte","Componentes Fórmula","Valor Presente","Ciclo Tarifário - R$ (Dez/20) x 1000"]
[null,null,null,null,null,null,2020,2021,{"$f":"H8+1","v":2022},2023,2024]
{"$rows_left_out":51}
{"sheet":"15. Ajustes Extraordinários","index":16,"n_rows":37,"n_cols":3,"rows_kept":37,"cut":false,"hidden":false,"merged":[]}
["N.","Ajustes Extraordinários","Saldo em dez/24"]
[1,{"$f":"B10","v":"Sobras Financeiras da 2a RTP"},{"$f":"C14","v":-130594580.36662702}]
[2,{"$f":"B16","v":"Contas Gráficas - Opex Parcela A"},{"$f":"C23","v":214579265.58195665}]
[3,{"$f":"B25","v":"Capital de giro 1a RTP"},{"$f":"C30","v":321845901.55503178}]
[4,{"$f":"B32","v":"Instalações e RO 1a RTP"},{"$f":"C37","v":169014142.03545111}]
["Total","-",{"$f":"SUM(C2:C5)","v":574844728.8058126}]
[]
["Detalhamento:"]
{"$rows_left_out":30}
{"sheet":"15.1 Ajustes Extra. Cont. Graf.","index":17,"n_rows":134,"n_cols":55,"rows_kept":134,"cut":false,"hidden":false,"merged":[]}
[]
[null,"COMPOSIÇÃO DAS COMPENSAÇÕES"]
[]
[null,"Compensações Ordinárias e Extraordinárias","2021-01-01","2021-02-01","2021-03-01","2021-04-01","2021-05-01","2021-06-01","2021-07-01","2021-08-01","2021-09-01","2021-10-01","2021-11-01","2021-12-01","2022-01-01","2022-02-01","2022-03-01","2022-04-01","2022-05-01","2022-06-01","2022-07-01","2022-08-01","2022-09-01","2022-10-01","2022-11-01","2022-12-01","2023-01-01","2023-02-01","2023-03-01","2023-04-01","2023-05-01","2023-06-01","2023-07-01","2023-08-01","2023-09-01","2023-10-01","2023-11-01","2023-12-01","2024-01-01","2024-02-01","2024-03-01","2024-04-01","2024-05-01","2024-06-01","2024-07-01","2024-08-01","2024-09-01","2024-10-01","2024-11-01","2024-12-01","2025-01-01","2025-02-01","2025-03-01","2025-04-01","2025-05-01"]
[null,"Saldo Inicial",1255477142.4970663,{"$f":"C13","v":1251516685.1104989},{"$f":"D13","v":1256341813.5787945},{"$f":"E13","v":1261243729.0028608},{"$f":"F13","v":1257986779.9736917},{"$f":"G13","v":1261858365.4287739},1248541709.5935595,1240968889.6273975,1230841178.3668118,1223217249.4534156,1217456722.8269267,1206812731.8434174,1191892909.2194111,1174580024.7634084,1164128565.9297676,1158112030.1910787,1148514538.050035,1131024092.0302663,1112683756.5244277,1078964177.3182549,1047571800.3425663,1016952325.9968846,995548002.14676404,970678247.12101662,946666027.37036419,922259008.0329628,898977297.45660388,875467249.56871998,848797363.41674495,818999048.97732162,785157277.65743291,752429301.97023869,719878448.90449953,686373493.36573637,651335415.66919196,615978521.29881835,581160763.33234131,543680225.27746844,509904085.79495096,470781517.08685565,433953066.25128186,395786005.37248182,355062997.13131809,315626801.05920362,273962786.52185774,231283744.99747247,187307905.32645136,143525428.03315282,99704827.684899107,53644946.074593499,7585064.464287892,-38474817.146017715,-84534698.756323323]
[null,"Índice de Correção (IPCA)",2.5000000000000001E-3,8.6E-3,9.300000000000001E-3,3.0999999999999999E-3,8.3000000000000001E-3,5.3E-3,9.5999999999999992E-3,8.6999999999999994E-3,1.1599999999999999E-2,1.2500000000000001E-2,9.4999999999999998E-3,7.3000000000000001E-3,5.4000000000000003E-3,1.01E-2,1.6200000000000003E-2,1.06E-2,4.7000000000000002E-3,6.7000000000000002E-3,-6.8000000000000005E-3,-3.5999999999999999E-3,-2.8999999999999998E-3,5.8999999999999999E-3,4.0999999999999995E-3,6.1999999999999998E-3,5.3E-3,8.3999999999999995E-3,7.0999999999999995E-3,6.0999999999999995E-3,2.3E-3,-8.0000000000000004E-4,1.1999999999999999E-3,2.3E-3,2.5999999999999999E-3,2.3999999999999998E-3,2.8000000000000004E-3,5.6000000000000008E-3,4.1999999999999997E-3,8.3000000000000001E-3,1.6000000000000001E-3,3.8E-3,4.5999999999999999E-3,2.0999999999999999E-3,3.8E-3,-2.0000000000000001E-4,4.4000000000000003E-3,5.5999999999999999E-3,3.8999999999999998E-3,5.1999999999999998E-3]
[null,"Saldo Corrigido Acumulado",{"$f":"C5*(1+C6)","v":1258615835.3533089},{"$f":"D5*(1+D6)","v":1262279728.6024492},{"$f":"E5*(1+E6)","v":1268025792.4450774},1265153584.5627699,1268428070.2474732,1268546214.7655466,1260527710.0056577,1251765318.9671557,1245118936.0358667,1238507465.0715833,{"$f":"M5*(1+M6)","v":1229022561.6937826},1215622464.7858744,1198329130.9291961,1186443283.0135188,1182987448.6978297,1170388017.7111039,1153912556.37887,1138601953.4468689,1105117506.9800615,1075079906.2799091,1044533842.1215729,1022952344.7202662,{"$f":"Y5*(1+Y6)","v":999629748.95556581},976696452.25316691,951683357.31542718,930005983.70043969,905360036.26854587,880807599.79108918,850749597.35260344,818343849.73813975,786099466.3906219,754159889.36477017,721750132.87165117,688020789.74981415,653159154.83306563,619428001.0180918,{"$f":"AM5*(1+AM6)","v":583601638.53833711},{"$f":"AN5*(1+AN6)","v":548192771.14727139},510719932.33222288,472570486.85178572,435949250.35603774,396617155.98376405,356412236.52041709,315563675.69899178,275168222.78255391,232578933.96945831,188038406.15722454,144271760.25892523,99704827.684899107,53644946.074593499,7585064.464287892,-38474817.146017715,-84534698.756323323]
[null,"Índice de Remuneração (WACC)",9.0934673743172656E-3,{"$f":"C8","v":9.0934673743172656E-3},{"$f":"D8","v":9.0934673743172656E-3},9.0934673743172656E-3,9.0934673743172656E-3,9.0934673743172656E-3,9.0934673743172656E-3,9.0934673743172656E-3,9.0934673743172656E-3,9.0934673743172656E-3,9.0934673743172656E-3,9.0934673743172656E-3,9.0934673743172656E-3,9.0934673743172656E-3,9.0934673743172656E-3,9.0934673743172656E-3,9.0934673743172656E-3,9.0934673743172656E-3,9.0934673743172656E-3,9.0934673743172656E-3,9.0934673743172656E-3,9.0934673743172656E-3,9.0934673743172656E-3,9.0934673743172656E-3,9.0934673743172656E-3,9.0934673743172656E-3,9.0934673743172656E-3,9.0934673743172656E-3,9.0934673743172656E-3,9.0934673743172656E-3,9.0934673743172656E-3,9.0934673743172656E-3,9.0934673743172656E-3,9.0934673743172656E-3,9.0934673743172656E-3,9.0934673743172656E-3,9.0934673743172656E-3,9.0934673743172656E-3,9.0934673743172656E-3,9.0934673743172656E-3,9.0934673743172656E-3,9.0934673743172656E-3,9.0934673743172656E-3,9.0934673743172656E-3,9.0934673743172656E-3,9.0934673743172656E-3,9.0934673743172656E-3,9.0934673743172656E-3]
{"$rows_left_out":127}
{"sheet":"16. Receita Verificada","index":18,"n_rows":25,"n_cols":11,"rows_kept":25,"cut":false,"hidden":false,"merged":[[1,5,1,9]]}
["Tabela - Tarifas Homologadas"]
["IRT","Tarifa","Aplicação","Fonte",null,"Média Diferença Tarifa Verificada/Homologada 2023-2024",null,null,null,null,{"$f":"G20/B4-1","v":-6.8108522195373666E-3}]
[2023,6.4385000000000003,"2023-04-24","Resolução 012/2023"]
[2024,6.6289999999999996,"2024-05-17","Resolução 019/2024"]
[]
[]
["Mês de Referência","Volume Faturado Histograma (m3)","Valor Faturado Histograma","Recálculo do Valor Faturado*","Alíquota COFINS/\nPASEP**","Receita Verificada exc. COFINS/PASEP","Valor R$/m3"]
["2023/10",85590479,584927365.88999999,606462605.67999995,7.2275982723743901E-2,{"$f":"D8-D8*E8","v":562629924.86927557},{"$f":"F8/B8","v":6.5735106456090238}]
{"$rows_left_out":18}
{"sheet":"Aux. - IPCA","index":19,"n_rows":468,"n_cols":8,"rows_kept":468,"cut":false,"hidden":false,"merged":[[296,3,296,7],[366,0,366,7],[369,3,369,7],[460,0,460,7],[147,0,147,7],[150,3,150,7],[219,0,219,7],[220,0,220,7],[223,3,223,7],[293,0,293,7],[146,0,146,7],[1,0,1,7],[4,3,4,7],[73,0,73,7],[74,0,74,7],[77,3,77,7]]}
[]
["SÉRIE HISTÓRICA DO IPCA"]
[null,null,null,null,null,null,null,"(continua)"]
[null,null,null,null,null,"    VARIAÇÃO"]
["ANO","MÊS","NÚMERO ÍNDICE","(%)"]
[null,null,"(DEZ 93 = 100)","NO",3,6,"NO",12]
[null,null,null,"MÊS","MESES","MESES","ANO","MESES"]
[]
{"$rows_left_out":461}
{"sheet":"Aux. - OPEX Realizado - Resumo","index":20,"n_rows":29,"n_cols":10,"rows_kept":29,"cut":false,"hidden":false,"merged":[[1,1,1,9],[18,1,18,9]]}
[]
[null,"OPEX ORIGINAL"]
[]
[null,null,null,null,null,2020,2021,2022,2023,"2024-09-01"]
[null,"Cód Blcte","Natureza","Descrição",null,"Total","Total","Total","Total","Total Estimado para o ano"]
[null,null,"Pessoal Total","Pessoal Total",null,1283438029.3999999,1152097246.6699998,1342761371.1100006,1463329831.8200002,1766509065.2666667]
[null,null,"Materiais Gerais Total","Materiais Gerais Total",null,71400133.199999988,84093787.23999998,98673769.479999974,112678575.11,114819141.71999998]
[null,null,"Materiais de Tratamento Total","Materiais de Tratamento Total",null,143969407.83000001,140364063.70000002,200548770.46000001,216613234.98000002,199079506.90666667]
{"$rows_left_out":21}